Skip to content

#67880 Applying a promo code recalculates period card prices.

test_tariff_change_promo_price_recalculated

Failures in last 30 days: 7

Generated at 2026-10-08 03:53 MSK

Last failure: 2026-10-02 11:50 MSK

Filter: pipelines with sandbox_biz_erp ∈ {master, testops-dev} AND autotests_branch ∈ {master, main} only (testops-dev — daytime ticks since 2026-08-05).

🏥 4 of these ran under the quarantine tier: XFAIL, pipeline stayed green, excluded from the red statistics and incidents (see Карантин).

By exception class: - TimeoutError — 3 - SigninRedirectMissingError — 3 - AssertionError — 1

Failure signatures (grouped by exception + full message):

TimeoutError — 2 occurrence(s) across 2 pipeline(s) (🏥 1 of 2 quarantined)

playwright._impl._errors.TimeoutError: Locator.click: Timeout 30000ms exceeded.
Call log:
  - waiting for locator("[class*=\"erp-nav-menu-mode-switch-footer-button\"]:visible, [class*=\"erp-nav-menu-mode-switch-mini__button\"]:visible").first
    - locator resolved to <div data-locator="nav_menu_mode_switch_btn" class="erp-nav-menu-mode-switch-footer-button">…</div>
  - attempting click action
    2 × waiting for element to be visible, enabled and stable
      - element is visible, enabled and stable
      - scrolling into view if needed
      - done scrolling
      - <div class="v-error-modal v-error-modal--unauthorized v-error-modal__fade-enter-active v-error-modal__fade-enter-to">…</div> intercepts pointer events
    - retrying click action
    - waiting 20ms
    - waiting for element to be visible, enabled and stable
    - element is visible, enabled and stable
    - scrolling into view if needed
    - done scrolling
    - <div class="v-error-modal v-error-modal--unauthorized v-error-modal__fade-enter-active v-error-modal__fade-enter-to">…</div> intercepts pointer events
  2 × retrying click action
      - waiting 100ms
      - waiting for element to be visible, enabled and stable
      - element is visible, enabled and stable
      - scrolling into view if needed
      - done scrolling
      - <div class="v-error-modal v-error-modal--unauthorized">…</div> intercepts pointer events
  55 × retrying click action
       - waiting 500ms
       - waiting for element to be visible, enabled and stable
       - element is visible, enabled and stable
       - scrolling into view if needed
       - done scrolling
       - <div class="v-error-modal v-error-modal--unauthorized">…</div> intercepts pointer events
  - retrying click action
    - waiting 500ms

Stacktrace:

suite/yclients/biz/erp/web/billing/license/test_tariff_change_promo_price_recalculated_pw.py:44 in test_tariff_change_promo_price_recalculated
lib/apps_pw/yclients/biz/erp/web/pages/__init__.py:77 in decorated
lib/apps_pw/yclients/biz/erp/web/pages/user.py:320 in open_license_overview
lib/apps_pw/yclients/biz/erp/web/pages/user.py:464 in _ensure_administration_mode_for_legacy_menu

Seen in: - altegio/biz.erp#227722 — shard 7 — launch 171516 (×1, last 2026-10-02 04:26 MSK) - altegio/biz.erp#227596 — shard 5 — launch 171280 (×1, last 2026-10-01 17:40 MSK)

AssertionError — 1 occurrence(s) across 1 pipeline(s)

AssertionError: Locator expected to be visible
Actual value: None
Error: element(s) not found
Call log:
  - Expect "to_be_visible" with timeout 30000ms
  - waiting for locator("[data-locator^=\"choose_license_period_card_\"]:not([data-locator*=\"free_month\"])").first

Stacktrace:

suite/yclients/biz/erp/web/billing/license/test_tariff_change_promo_price_recalculated_pw.py:47 in test_tariff_change_promo_price_recalculated
lib/apps_pw/yclients/biz/erp/web/pages/__init__.py:77 in decorated
lib/apps_pw/yclients/biz/erp/web/pages/billing/license/tariff_change.py:176 in wait_page_ready

Seen in: - altegio/biz.erp#227596 — shard 5 — launch 171280 (×1, last 2026-10-01 17:40 MSK)

🏥 SigninRedirectMissingError — 1 occurrence(s) across 1 pipeline(s)

autotests.lib.exception.SigninRedirectMissingError: login-XHR завершился со статусом 200, но редиректа со /signin/ не случилось за 30 с — подозрение на фронт biz.erp
--- причина (playwright) ---
Timeout 30000ms exceeded.
=========================== logs ===========================
waiting for navigation to "<function ImplToApiMapping.wrap_handler.<locals>.wrapper_func at 0x7f3260b219e0>" until 'commit'
  navigated to "https://erp-testops-dev.infra.altegio.cloud/signin/"
  navigated to "https://erp-testops-dev.infra.altegio.cloud/signin/"
  navigated to "https://erp-testops-dev.infra.altegio.cloud/signin/JTJGdGltZXRhYmxlJTJGMTYzNjE3NjUlMkY="
  navigated to "https://erp-testops-dev.infra.altegio.cloud/signin/JTJGdGltZXRhYmxlJTJGMTYzNjE3NjUlMkY="
  navigated to "https://erp-testops-dev.infra.altegio.cloud/signin/JTJGdGltZXRhYmxlJTJGMTYzNjE3NjUlMkY="
============================================================

Stacktrace:

suite/yclients/biz/erp/web/billing/license/test_tariff_change_promo_price_recalculated_pw.py:36 in test_tariff_change_promo_price_recalculated
lib/apps_pw/yclients/biz/erp/web/pages/guest/signin.py:115 in sign_in

Seen in: - altegio/biz.erp#227735 — shard 1 — launch 171549 (×1, last 2026-10-02 06:23 MSK)

🏥 SigninRedirectMissingError — 1 occurrence(s) across 1 pipeline(s)

autotests.lib.exception.SigninRedirectMissingError: login-XHR завершился со статусом 200, но редиректа со /signin/ не случилось за 30 с — подозрение на фронт biz.erp
--- причина (playwright) ---
Timeout 30000ms exceeded.
=========================== logs ===========================
waiting for navigation to "<function ImplToApiMapping.wrap_handler.<locals>.wrapper_func at 0x7f0d38b8d260>" until 'commit'
  navigated to "https://erp-testops-dev.infra.altegio.cloud/signin/"
  navigated to "https://erp-testops-dev.infra.altegio.cloud/signin/"
  navigated to "https://erp-testops-dev.infra.altegio.cloud/signin/JTJGdGltZXRhYmxlJTJGMTYzNjU0NTglMkY="
  navigated to "https://erp-testops-dev.infra.altegio.cloud/signin/JTJGdGltZXRhYmxlJTJGMTYzNjU0NTglMkY="
  navigated to "https://erp-testops-dev.infra.altegio.cloud/signin/JTJGdGltZXRhYmxlJTJGMTYzNjU0NTglMkY="
============================================================

Stacktrace:

suite/yclients/biz/erp/web/billing/license/test_tariff_change_promo_price_recalculated_pw.py:36 in test_tariff_change_promo_price_recalculated
lib/apps_pw/yclients/biz/erp/web/pages/guest/signin.py:115 in sign_in

Seen in: - altegio/biz.erp#227749 — shard 2 — launch 171616 (×1, last 2026-10-02 08:20 MSK)

🏥 SigninRedirectMissingError — 1 occurrence(s) across 1 pipeline(s)

autotests.lib.exception.SigninRedirectMissingError: login-XHR завершился со статусом 200, но редиректа со /signin/ не случилось за 30 с — подозрение на фронт biz.erp
--- причина (playwright) ---
Timeout 30000ms exceeded.
=========================== logs ===========================
waiting for navigation to "<function ImplToApiMapping.wrap_handler.<locals>.wrapper_func at 0x7fa7ac355da0>" until 'commit'
  navigated to "https://erp-testops-dev.infra.altegio.cloud/signin/"
  navigated to "https://erp-testops-dev.infra.altegio.cloud/signin/"
  navigated to "https://erp-testops-dev.infra.altegio.cloud/signin/JTJGdGltZXRhYmxlJTJGMTYzNjkzMjklMkY="
  navigated to "https://erp-testops-dev.infra.altegio.cloud/signin/JTJGdGltZXRhYmxlJTJGMTYzNjkzMjklMkY="
  navigated to "https://erp-testops-dev.infra.altegio.cloud/signin/JTJGdGltZXRhYmxlJTJGMTYzNjkzMjklMkY="
============================================================

Stacktrace:

suite/yclients/biz/erp/web/billing/license/test_tariff_change_promo_price_recalculated_pw.py:36 in test_tariff_change_promo_price_recalculated
lib/apps_pw/yclients/biz/erp/web/pages/guest/signin.py:115 in sign_in

Seen in: - altegio/biz.erp#227787 — shard 7 — launch 171752 (×1, last 2026-10-02 11:50 MSK)

TimeoutError — 1 occurrence(s) across 1 pipeline(s)

playwright._impl._errors.TimeoutError: Locator.click: Timeout 30000ms exceeded.
Call log:
  - waiting for locator("#side-menu li.nav-menu-category:has(ul.nav-second-level a[href*=\"/balance/\"])").first.locator("> a").first
    - locator resolved to <a href="/balance/16356817/">…</a>
  - attempting click action
    - waiting for element to be visible, enabled and stable
    - element is visible, enabled and stable
    - scrolling into view if needed
    - done scrolling
    - <div class="v-error-modal v-error-modal--unauthorized">…</div> intercepts pointer events
  - retrying click action
    - waiting for element to be visible, enabled and stable
    - element is visible, enabled and stable
    - scrolling into view if needed
    - done scrolling
    - <div class="v-error-modal v-error-modal--unauthorized v-error-modal__fade-enter-from v-error-modal__fade-enter-active">…</div> intercepts pointer events
  - retrying click action
    - waiting 20ms
    - waiting for element to be visible, enabled and stable
    - element is visible, enabled and stable
    - scrolling into view if needed
    - done scrolling
    - <div class="v-error-modal v-error-modal--unauthorized v-error-modal__fade-enter-from v-error-modal__fade-enter-active">…</div> intercepts pointer events
  2 × retrying click action
      - waiting 100ms
      - waiting for element to be visible, enabled and stable
      - element is visible, enabled and stable
      - scrolling into view if needed
      - done scrolling
      - <div class="v-error-modal v-error-modal--unauthorized v-error-modal__fade-enter-active v-error-modal__fade-enter-to">…</div> intercepts pointer events
  17 × retrying click action
       - waiting 500ms
       - waiting for element to be visible, enabled and stable
       - element is visible, enabled and stable
       - scrolling into view if needed
       - done scrolling
       - <div class="v-error-modal v-error-modal--unauthorized">…</div> intercepts pointer events
  9 × retrying click action
      - waiting 500ms
      - waiting for element to be visible, enabled and stable
      - element is visible, enabled and stable
      - scrolling into view if needed
      - done scrolling
      - <div class="v-error-modal v-error-modal--unauthorized v-error-modal__fade-enter-active v-error-modal__fade-enter-to">…</div> intercepts pointer events
    - retrying click action
      - waiting 500ms
      - waiting for element to be visible, enabled and stable
      - element is visible, enabled and stable
      - scrolling into view if needed
      - done scrolling
      - <div class="v-error-modal v-error-modal--unauthorized">…</div> intercepts pointer events
    - retrying click action
      - waiting 500ms
      - waiting for element to be visible, enabled and stable
      - element is visible, enabled and stable
      - scrolling into view if needed
      - done scrolling
      - <div class="v-error-modal v-error-modal--unauthorized">…</div> intercepts pointer events
    - retrying click action
      - waiting 500ms
      - waiting for element to be visible, enabled and stable
      - element is visible, enabled and stable
      - scrolling into view if needed
      - done scrolling
      - <div class="v-error-modal v-error-modal--unauthorized">…</div> intercepts pointer events
  - retrying click action
    - waiting 500ms
    - waiting for element to be visible, enabled and stable
    - element is visible, enabled and stable
    - scrolling into view if needed
    - done scrolling
    - <div class="v-error-modal v-error-modal--unauthorized v-error-modal__fade-enter-active v-error-modal__fade-enter-to">…</div> intercepts pointer events
  2 × retrying click action
      - waiting 500ms
      - waiting for element to be visible, enabled and stable
      - element is visible, enabled and stable
      - scrolling into view if needed
      - done scrolling
      - <div class="v-error-modal v-error-modal--unauthorized">…</div> intercepts pointer events
  ... [truncated]

Stacktrace:

suite/yclients/biz/erp/web/billing/license/test_tariff_change_promo_price_recalculated_pw.py:44 in test_tariff_change_promo_price_recalculated
lib/apps_pw/yclients/biz/erp/web/pages/__init__.py:77 in decorated
lib/apps_pw/yclients/biz/erp/web/pages/user.py:331 in open_license_overview

Seen in: - altegio/biz.erp#227596 — shard 5 — launch 171280 (×1, last 2026-10-01 17:40 MSK)