Skip to content

Переход по прямой ссылке. Нет слотов у единственного сотрудника.

Редирект на выбор филиалов. Несетевой виджет.

test_the_only_master_has_no_slots_go_by_straight_link

Failures in last 30 days: 3

Generated at 2026-10-08 03:53 MSK

Last failure: 2026-09-21 08:16 MSK

Filter: pipelines with sandbox_biz_erp ∈ {master, testops-dev} AND autotests_branch ∈ {master, main} only (testops-dev — daytime ticks since 2026-08-05).

By exception class: - WebDriverException — 3

Failure signatures (grouped by exception + full message):

WebDriverException — 1 occurrence(s) across 1 pipeline(s)

selenium.common.exceptions.WebDriverException: Message: <unknown>: Failed to read the 'localStorage' property from 'Window': Access is denied for this document.
  (Session info: headless chrome=119.0.6045.199)
Stacktrace:
#0 0x55c7da6b35e3 <unknown>
#1 0x55c7da3760b7 <unknown>
#2 0x55c7da37c2b5 <unknown>
#3 0x55c7da37e9b1 <unknown>
#4 0x55c7da40771f <unknown>
#5 0x55c7da3eaef2 <unknown>
#6 0x55c7da406b3d <unknown>
#7 0x55c7da3eacc3 <unknown>
#8 0x55c7da3b60e4 <unknown>
#9 0x55c7da3b70ae <unknown>
#10 0x55c7da679ce1 <unknown>
#11 0x55c7da67db7e <unknown>
#12 0x55c7da6674b5 <unknown>
#13 0x55c7da67e7d6 <unknown>
#14 0x55c7da64adbf <unknown>
#15 0x55c7da6a1748 <unknown>
#16 0x55c7da6a1917 <unknown>
#17 0x55c7da6b2773 <unknown>
#18 0x7f8e589c8aa4 <unknown>
#19 0x7f8e58a55a64 __clone

Stacktrace:

lib/common/ui/pages/web.py:61 in decorated
lib/apps/yclients/client/booking/web/pages/__init__.py:80 in open
lib/common/ui/pages/web.py:61 in decorated
lib/apps/yclients/client/booking/web/pages/__init__.py:41 in set_environment
lib/ui/selenium/webdriver/__init__.py:52 in execute_script

Seen in: - altegio/client.booking#224668 — shard 1 — launch 165208 (×1, last 2026-09-21 08:16 MSK)

WebDriverException — 1 occurrence(s) across 1 pipeline(s)

selenium.common.exceptions.WebDriverException: Message: <unknown>: Failed to read the 'localStorage' property from 'Window': Access is denied for this document.
  (Session info: headless chrome=119.0.6045.199)
Stacktrace:
#0 0x5638ece125e3 <unknown>
#1 0x5638ecad50b7 <unknown>
#2 0x5638ecadb2b5 <unknown>
#3 0x5638ecadd9b1 <unknown>
#4 0x5638ecb6671f <unknown>
#5 0x5638ecb49ef2 <unknown>
#6 0x5638ecb65b3d <unknown>
#7 0x5638ecb49cc3 <unknown>
#8 0x5638ecb150e4 <unknown>
#9 0x5638ecb160ae <unknown>
#10 0x5638ecdd8ce1 <unknown>
#11 0x5638ecddcb7e <unknown>
#12 0x5638ecdc64b5 <unknown>
#13 0x5638ecddd7d6 <unknown>
#14 0x5638ecda9dbf <unknown>
#15 0x5638ece00748 <unknown>
#16 0x5638ece00917 <unknown>
#17 0x5638ece11773 <unknown>
#18 0x7f3a0134aaa4 <unknown>
#19 0x7f3a013d7a64 __clone

Stacktrace:

lib/common/ui/pages/web.py:61 in decorated
lib/apps/yclients/client/booking/web/pages/__init__.py:80 in open
lib/common/ui/pages/web.py:61 in decorated
lib/apps/yclients/client/booking/web/pages/__init__.py:41 in set_environment
lib/ui/selenium/webdriver/__init__.py:52 in execute_script

Seen in: - altegio/client.booking#224668 — shard 1 — launch 165208 (×1, last 2026-09-21 08:16 MSK)

WebDriverException — 1 occurrence(s) across 1 pipeline(s)

selenium.common.exceptions.WebDriverException: Message: <unknown>: Failed to read the 'localStorage' property from 'Window': Access is denied for this document.
  (Session info: headless chrome=119.0.6045.199)
Stacktrace:
#0 0x56165c2535e3 <unknown>
#1 0x56165bf160b7 <unknown>
#2 0x56165bf1c2b5 <unknown>
#3 0x56165bf1e9b1 <unknown>
#4 0x56165bfa771f <unknown>
#5 0x56165bf8aef2 <unknown>
#6 0x56165bfa6b3d <unknown>
#7 0x56165bf8acc3 <unknown>
#8 0x56165bf560e4 <unknown>
#9 0x56165bf570ae <unknown>
#10 0x56165c219ce1 <unknown>
#11 0x56165c21db7e <unknown>
#12 0x56165c2074b5 <unknown>
#13 0x56165c21e7d6 <unknown>
#14 0x56165c1eadbf <unknown>
#15 0x56165c241748 <unknown>
#16 0x56165c241917 <unknown>
#17 0x56165c252773 <unknown>
#18 0x7f25c4f57aa4 <unknown>
#19 0x7f25c4fe4a64 __clone

Stacktrace:

lib/common/ui/pages/web.py:61 in decorated
lib/apps/yclients/client/booking/web/pages/__init__.py:80 in open
lib/common/ui/pages/web.py:61 in decorated
lib/apps/yclients/client/booking/web/pages/__init__.py:41 in set_environment
lib/ui/selenium/webdriver/__init__.py:52 in execute_script

Seen in: - altegio/client.booking#224668 — shard 1 — launch 165208 (×1, last 2026-09-21 08:16 MSK)